rejoinder-n
type: LexicalEntry
canonical form: rejoinder
sense: 06575315-n
part of speech: noun

06575315-n
type: LexicalConcept
in scheme: en-word.net
definition: (law) a pleading made by a defendant in response to the plaintiff's replication
ili: i70948
lexfile: noun.communication
part of speech: noun
domain topic: 08458195-n
hypernym: 06571356-n