demurrer-n
type: LexicalEntry
canonical form: demurrer
sense: 06574793-n
part of speech: noun

06574793-n
type: LexicalConcept
in scheme: en-word.net
definition: (law) any pleading that attacks the legal sufficiency of the opponent's pleadings
ili: i70945
lexfile: noun.communication
part of speech: noun
domain topic: 08458195-n
hypernym: 06571356-n