execution-n
type: LexicalEntry
canonical form: execution
sense: 06566069-n
part of speech: noun

execution of instrument-n
type: LexicalEntry
canonical form: execution of instrument
sense: 06566069-n
part of speech: noun

06566069-n
type: LexicalConcept
in scheme: en-word.net
definition: (law) the completion of a legal instrument (such as a contract or deed) by signing it (and perhaps sealing and delivering it) so that it becomes legally binding and enforceable
ili: i70905
lexfile: noun.communication
part of speech: noun
domain topic: 08458195-n
hypernym: 00616899-n