act-n
type: LexicalEntry
canonical form: act
sense: 06544086-n
part of speech: noun

enactment-n
type: LexicalEntry
canonical form: enactment
sense: 06544086-n
part of speech: noun

06544086-n
type: LexicalConcept
in scheme: en-word.net
definition: a legal document codifying the result of deliberations of a committee or society or legislative body
ili: i70795
lexfile: noun.communication
part of speech: noun
domain topic: 08458195-n
hypernym: 06491336-n