lease-n
type: LexicalEntry
canonical form: lease
sense: 06535123-n
part of speech: noun

06535123-n
type: LexicalConcept
in scheme: en-word.net
definition: a contract granting use or occupation of property during a specified time for a specified payment
ili: i70744
lexfile: noun.communication
part of speech: noun
hypernym: 06532935-n