contents-n
type: LexicalEntry
canonical form: contents
sense: 06501650-n
part of speech: noun

table of contents-n
type: LexicalEntry
canonical form: table of contents
sense: 06501650-n
part of speech: noun

06501650-n
type: LexicalConcept
in scheme: en-word.net
definition: a list of divisions (chapters or articles) and the pages on which they start
ili: i70555
lexfile: noun.communication
part of speech: noun
hypernym: 06492991-n
hypernym: 08283156-n