docket-n
type: LexicalEntry
canonical form: docket
sense: 06497282-n
part of speech: noun

06497282-n
type: LexicalConcept
in scheme: en-word.net
definition: (law) the calendar of a court; the list of cases to be tried or a summary of the court's activities
ili: i70530
lexfile: noun.communication
part of speech: noun
domain topic: 08458195-n
hypernym: 06499232-n