questionnaire-n
type: LexicalEntry
canonical form: questionnaire
sense: 06485793-n
part of speech: noun

06485793-n
type: LexicalConcept
in scheme: en-word.net
definition: a form containing a set of questions; submitted to people to gain statistical information
ili: i70479
lexfile: noun.communication
part of speech: noun
hypernym: 06485234-n