reckoner-n
type: LexicalEntry
canonical form: reckoner
sense: 06435139-n
part of speech: noun

ready reckoner-n
type: LexicalEntry
canonical form: ready reckoner
sense: 06435139-n
part of speech: noun

06435139-n
type: LexicalConcept
in scheme: en-word.net
definition: a handbook of tables used to facilitate computation
ili: i70255
lexfile: noun.communication
part of speech: noun
hypernym: 06432944-n