guidebook-n
type: LexicalEntry
canonical form: guidebook
sense: 06434383-n
part of speech: noun

guide-n
type: LexicalEntry
canonical form: guide
sense: 06434383-n
part of speech: noun

06434383-n
type: LexicalConcept
in scheme: en-word.net
definition: something that offers basic information or instruction
ili: i70250
lexfile: noun.communication
part of speech: noun
hypernym: 06432944-n