dictation-n
type: LexicalEntry
canonical form: dictation
sense: 06398975-n
part of speech: noun

06398975-n
type: LexicalConcept
in scheme: en-word.net
definition: matter that has been dictated and transcribed; a dictated passage
example: he signed and mailed his dictation without bothering to read it
ili: i70054
lexfile: noun.communication
part of speech: noun
hypernym: 06376912-n