thriller-n
type: LexicalEntry
canonical form: thriller
sense: 06382026-n
part of speech: noun

06382026-n
type: LexicalConcept
in scheme: en-word.net
definition: a suspenseful adventure story or play or movie
ili: i69954
lexfile: noun.communication
part of speech: noun
hypernym: 06381891-n