novel-n
type: LexicalEntry
canonical form: novel
sense: 06379324-n
part of speech: noun

06379324-n
type: LexicalConcept
in scheme: en-word.net
definition: an extended fictional work in prose; usually in the form of a story
ili: i69939
lexfile: noun.communication
part of speech: noun
hypernym: 06378552-n