headword-n
type: LexicalEntry
canonical form: headword
sense: 06302934-n
part of speech: noun

head word-n
type: LexicalEntry
canonical form: head word
sense: 06302934-n
part of speech: noun

06302934-n
type: LexicalConcept
in scheme: en-word.net
definition: a content word that can be qualified by a modifier
ili: i69565
lexfile: noun.communication
part of speech: noun
hypernym: 06300030-n