slot-n
type: LexicalEntry
canonical form: slot
sense: 06295226-n
part of speech: noun

06295226-n
type: LexicalConcept
in scheme: en-word.net
definition: a position in a grammatical linguistic construction in which a variety of alternative units are interchangeable
example: he developed a version of slot grammar
ili: i69534
lexfile: noun.communication
part of speech: noun
hypernym: 05081943-n