article-n
type: LexicalEntry
canonical form: article
sense: 06278749-n
part of speech: noun

06278749-n
type: LexicalConcept
in scheme: en-word.net
definition: nonfictional prose forming an independent part of a publication
ili: i69447
lexfile: noun.communication
part of speech: noun
hypernym: 06379016-n
hypernym: 06280049-n