page-n
type: LexicalEntry
canonical form: page
sense: 06267274-n
part of speech: noun

06267274-n
type: LexicalConcept
in scheme: en-word.net
definition: one side of one leaf (of a book or magazine or newspaper or letter etc.) or the written or pictorial matter it contains
ili: i69383
lexfile: noun.communication
part of speech: noun
hypernym: 06266806-n
mero part: 06269333-n
mero part: 06401041-n
mero part: 06808025-n
mero substance: 06266190-n