signature-n
type: LexicalEntry
canonical form: signature
sense: 06266618-n
part of speech: noun

06266618-n
type: LexicalConcept
in scheme: en-word.net
definition: a sheet with several pages printed on it; it folds to page size and is bound with other signatures to form a book
ili: i69379
lexfile: noun.communication
part of speech: noun
hypernym: 06266354-n