direction-n
type: LexicalEntry
canonical form: direction
sense: 06206950-n
part of speech: noun

06206950-n
type: LexicalConcept
in scheme: en-word.net
definition: a general course along which something has a tendency to develop
example: I couldn't follow the direction of his thoughts
example: his ideals determined the direction of his career
example: they proposed a new direction for the firm
ili: i69097
lexfile: noun.cognition
part of speech: noun
hypernym: 06206319-n