phonetics-n
type: LexicalEntry
canonical form: phonetics
sense: 06186749-n
part of speech: noun

06186749-n
type: LexicalConcept
in scheme: en-word.net
definition: the branch of acoustics concerned with speech processes including its production and perception and acoustic analysis
ili: i68999
lexfile: noun.cognition
part of speech: noun
hypernym: 06104381-n