information technology-n
type: LexicalEntry
canonical form: information technology
sense: 06143961-n
part of speech: noun

IT-n
type: LexicalEntry
canonical form: IT
sense: 06143961-n
part of speech: noun

06143961-n
type: LexicalConcept
in scheme: en-word.net
definition: the branch of engineering that deals with the use of computers and telecommunications to retrieve and store and transmit information
ili: i68822
lexfile: noun.cognition
part of speech: noun
hypernym: 06134474-n