logic-n
type: LexicalEntry
canonical form: logic
sense: 06142469-n
part of speech: noun

06142469-n
type: LexicalConcept
in scheme: en-word.net
definition: the system of operations performed by a computer that underlies the machine's representation of logical operations
ili: i68814
lexfile: noun.cognition
part of speech: noun
domain topic: 06138021-n
hypernym: 05669841-n