hydrology-n
type: LexicalEntry
canonical form: hydrology
sense: 06129336-n
part of speech: noun

06129336-n
type: LexicalConcept
in scheme: en-word.net
definition: the branch of geology that studies water on the earth and in the atmosphere: its distribution and uses and conservation
ili: i68773
lexfile: noun.cognition
part of speech: noun
hypernym: 06127169-n