geology-n
type: LexicalEntry
canonical form: geology
sense: 06125308-n
part of speech: noun

06125308-n
type: LexicalConcept
in scheme: en-word.net
definition: a science that deals with the history of the earth as recorded in rocks
ili: i68760
lexfile: noun.cognition
part of speech: noun
hypernym: 06125083-n