origin-n
type: LexicalEntry
canonical form: origin
sense: 06018435-n
part of speech: noun

06018435-n
type: LexicalConcept
in scheme: en-word.net
definition: the point of intersection of coordinate axes; where the values of the coordinates are all zero
ili: i68365
lexfile: noun.cognition
part of speech: noun
hypernym: 13895852-n