genealogy-n
type: LexicalEntry
canonical form: genealogy
sense: 06007403-n
part of speech: noun

06007403-n
type: LexicalConcept
in scheme: en-word.net
definition: the study or investigation of ancestry and family history
ili: i68329
lexfile: noun.cognition
part of speech: noun
hypernym: 06005806-n