sensualism-n
type: LexicalEntry
canonical form: sensualism
sense: 05985338-n
part of speech: noun

sensationalism-n
type: LexicalEntry
canonical form: sensationalism
sense: 05985338-n
part of speech: noun

05985338-n
type: LexicalConcept
in scheme: en-word.net
definition: (philosophy) the ethical doctrine that feeling is the only criterion for what is good
ili: i68229
lexfile: noun.cognition
part of speech: noun
domain topic: 06168062-n
hypernym: 06177044-n