individualism-n
type: LexicalEntry
canonical form: individualism
sense: 05971803-n
part of speech: noun

laissez faire-n
type: LexicalEntry
canonical form: laissez faire
sense: 05971803-n
part of speech: noun

05971803-n
type: LexicalConcept
in scheme: en-word.net
definition: the doctrine that government should not interfere in commercial affairs
ili: i68163
lexfile: noun.cognition
part of speech: noun
hypernym: 05952149-n