cult-n
type: LexicalEntry
canonical form: cult
sense: 05957404-n
part of speech: noun

05957404-n
type: LexicalConcept
in scheme: en-word.net
definition: a religion or sect that is generally considered to be unorthodox, extremist, or false
example: it was a satanic cult
ili: i68080
lexfile: noun.cognition
part of speech: noun
hypernym: 05955536-n