shape-n
type: LexicalEntry
canonical form: shape
sense: 05949928-n
part of speech: noun

embodiment-n
type: LexicalEntry
canonical form: embodiment
sense: 05949928-n
part of speech: noun

05949928-n
type: LexicalConcept
in scheme: en-word.net
definition: a concrete representation of an otherwise nebulous concept
example: a circle was the embodiment of his concept of life
ili: i68060
lexfile: noun.cognition
part of speech: noun
hypernym: 05949755-n