fusion-n
type: LexicalEntry
canonical form: fusion
sense: 05945279-n
part of speech: noun

optical fusion-n
type: LexicalEntry
canonical form: optical fusion
sense: 05945279-n
part of speech: noun

05945279-n
type: LexicalConcept
in scheme: en-word.net
definition: the combining of images from the two eyes to form a single visual percept
ili: i68033
lexfile: noun.cognition
part of speech: noun
hypernym: 05718807-n