stuff-n
type: LexicalEntry
canonical form: stuff
sense: 05930937-n
part of speech: noun

05930937-n
type: LexicalConcept
in scheme: en-word.net
definition: a critically important or characteristic component
example: suspense is the very stuff of narrative
ili: i67955
lexfile: noun.cognition
part of speech: noun
hypernym: 05929717-n