theme-n
type: LexicalEntry
canonical form: theme
sense: 05928866-n
part of speech: noun

motif-n
type: LexicalEntry
canonical form: motif
sense: 05928866-n
part of speech: noun

05928866-n
type: LexicalConcept
in scheme: en-word.net
definition: a unifying idea that is a recurrent element in literary or artistic work
example: it was the usual ‘boy gets girl’ theme
ili: i67946
lexfile: noun.cognition
part of speech: noun
hypernym: 05842164-n