principle-n
type: LexicalEntry
canonical form: principle
sense: 05882839-n
part of speech: noun

rule-n
type: LexicalEntry
canonical form: rule
sense: 05882839-n
part of speech: noun

05882839-n
type: LexicalConcept
in scheme: en-word.net
definition: a rule or law concerning a natural phenomenon or the function of a complex system
example: the principle of the conservation of mass
example: the principle of jet propulsion
example: the right-hand rule for inductive fields
ili: i67738
lexfile: noun.cognition
part of speech: noun
hypernym: 05881589-n