series-n
type: LexicalEntry
canonical form: series
sense: 05871305-n
part of speech: noun

05871305-n
type: LexicalConcept
in scheme: en-word.net
definition: (mathematics) the sum of a finite or infinite sequence of expressions
ili: i67684
lexfile: noun.cognition
part of speech: noun
domain topic: 06009822-n
hypernym: 05870439-n