double-n
type: LexicalEntry
canonical form: double
sense: 05868784-n
part of speech: noun

05868784-n
type: LexicalConcept
in scheme: en-word.net
definition: a quantity that is twice as great as another
example: 36 is the double of 18
ili: i67667
lexfile: noun.cognition
part of speech: noun
hypernym: 05868575-n