parameter-n
type: LexicalEntry
canonical form: parameter
sense: 05867861-n
part of speech: noun

05867861-n
type: LexicalConcept
in scheme: en-word.net
definition: a quantity (such as the mean or variance) that characterizes a statistical population and that can be estimated by calculations from sample data
ili: i67662
lexfile: noun.cognition
part of speech: noun
hypernym: 05863690-n