quantity-n
type: LexicalEntry
canonical form: quantity
sense: 05863690-n
part of speech: noun

05863690-n
type: LexicalConcept
in scheme: en-word.net
definition: the concept that something has a magnitude and can be represented in mathematical expressions by a constant or a variable
ili: i67640
lexfile: noun.cognition
part of speech: noun
domain topic: 06009822-n
hypernym: 05844071-n