surface-n
type: LexicalEntry
canonical form: surface
sense: 05862014-n
part of speech: noun

05862014-n
type: LexicalConcept
in scheme: en-word.net
definition: a superficial aspect as opposed to the real nature of something
example: it was not what it appeared to be on the surface
ili: i67632
lexfile: noun.cognition
part of speech: noun
hypernym: 05859151-n