aspect-n
type: LexicalEntry
canonical form: aspect
sense: 05859151-n
part of speech: noun

facet-n
type: LexicalEntry
canonical form: facet
sense: 05859151-n
part of speech: noun

05859151-n
type: LexicalConcept
in scheme: en-word.net
definition: a distinct feature or element in a problem
example: he studied every facet of the question
ili: i67617
lexfile: noun.cognition
part of speech: noun
hypernym: 05858316-n