feature of speech-n
type: LexicalEntry
canonical form: feature of speech
sense: 05858739-n
part of speech: noun

feature-n
type: LexicalEntry
canonical form: feature
sense: 05858739-n
part of speech: noun

05858739-n
type: LexicalConcept
in scheme: en-word.net
definition: (linguistics) a distinctive characteristic of a linguistic unit that serves to distinguish it from other units of the same kind
ili: i67615
lexfile: noun.cognition
part of speech: noun
domain topic: 06182505-n
hypernym: 05857567-n