feature-n
type: LexicalEntry
canonical form: feature
sense: 05858316-n
part of speech: noun

characteristic-n
type: LexicalEntry
canonical form: characteristic
sense: 05858316-n
part of speech: noun

05858316-n
type: LexicalConcept
in scheme: en-word.net
definition: a prominent attribute or aspect of something
example: the map showed roads and other features
example: generosity is one of his best characteristics
ili: i67614
lexfile: noun.cognition
part of speech: noun
hypernym: 05857567-n