rule-n
type: LexicalEntry
canonical form: rule
sense: 05854581-n
part of speech: noun

regulation-n
type: LexicalEntry
canonical form: regulation
sense: 05854581-n
part of speech: noun

05854581-n
type: LexicalConcept
in scheme: en-word.net
definition: a principle or condition that customarily governs behavior
example: it was his rule to take a walk before breakfast
example: short haircuts were the regulation
ili: i67597
lexfile: noun.cognition
part of speech: noun
hypernym: 05844071-n