trap-n
type: LexicalEntry
canonical form: trap
sense: 05845694-n
part of speech: noun

snare-n
type: LexicalEntry
canonical form: snare
sense: 05845694-n
part of speech: noun

05845694-n
type: LexicalConcept
in scheme: en-word.net
definition: something (often something deceptively attractive) that catches you unawares
example: the exam was full of trap questions
example: it was all a snare and delusion
ili: i67551
lexfile: noun.cognition
part of speech: noun
hypernym: 05736623-n