background-n
type: LexicalEntry
canonical form: background
sense: 05831841-n
part of speech: noun

background knowledge-n
type: LexicalEntry
canonical form: background knowledge
sense: 05831841-n
part of speech: noun

05831841-n
type: LexicalConcept
in scheme: en-word.net
definition: information that is essential to understanding a situation or problem
example: the embassy filled him in on the background of the incident
ili: i67484
lexfile: noun.cognition
part of speech: noun
hypernym: 05824413-n