sample-n
type: LexicalEntry
canonical form: sample
sense: 05830135-n
part of speech: noun

05830135-n
type: LexicalConcept
in scheme: en-word.net
definition: a small part of something intended as representative of the whole
ili: i67474
lexfile: noun.cognition
part of speech: noun
hypernym: 05828980-n