eye-catcher-n
type: LexicalEntry
canonical form: eye-catcher
sense: 05820915-n
part of speech: noun

05820915-n
type: LexicalConcept
in scheme: en-word.net
definition: a striking person or thing that attracts attention
ili: i67427
lexfile: noun.cognition
part of speech: noun
hypernym: 05820064-n