credit rating-n
type: LexicalEntry
canonical form: credit rating
sense: 05811755-n
part of speech: noun

credit-n
type: LexicalEntry
canonical form: credit
sense: 05811755-n
part of speech: noun

05811755-n
type: LexicalConcept
in scheme: en-word.net
definition: an estimate, based on previous dealings, of a person's or an organization's ability to fulfill their financial commitments
ili: i67382
lexfile: noun.cognition
part of speech: noun
hypernym: 05811387-n