explanation-n
type: LexicalEntry
canonical form: explanation
sense: 05801008-n
part of speech: noun

05801008-n
type: LexicalConcept
in scheme: en-word.net
definition: thought that makes something comprehensible
ili: i67330
lexfile: noun.cognition
part of speech: noun
hypernym: 05778923-n
mero part: 05801562-n