search-n
type: LexicalEntry
canonical form: search
sense: 05778055-n
part of speech: noun

05778055-n
type: LexicalConcept
in scheme: en-word.net
definition: the examination of alternative hypotheses
example: his search for a move that would avoid checkmate was unsuccessful
ili: i67216
lexfile: noun.cognition
part of speech: noun
hypernym: 05778661-n